Сбой компиляции dieharder на Apple Silicon: «ld: символ (ы) не найден для архитектуры arm64»

Попытка скомпилировать dieharder из исходного кода на M1 Max (macOS 12 + Xcode 13.3.1 + инструменты командной строки) и ошибка:

...
/bin/sh ../libtool --tag=CC   --mode=link gcc -std=c99 -Wall -pedantic -I/usr/local/include -I/opt/local/include  -L/opt/local/lib -o dieharder dieharder-add_ui_rngs.o dieharder-add_ui_tests.o dieharder-choose_rng.o dieharder-dieharder.o dieharder-dieharder_exit.o dieharder-help.o dieharder-list_rngs.o dieharder-list_tests.o dieharder-output.o dieharder-output_rnds.o dieharder-parsecl.o dieharder-rdieharder.o dieharder-run_all_tests.o dieharder-run_test.o dieharder-set_globals.o dieharder-testbits.o dieharder-time_rng.o dieharder-user_template.o ../libdieharder/libdieharder.la -lgsl -lgslcblas -lm -lgsl -lgslcblas
libtool: link: gcc -std=c99 -Wall -pedantic -I/usr/local/include -I/opt/local/include -o dieharder dieharder-add_ui_rngs.o dieharder-add_ui_tests.o dieharder-choose_rng.o dieharder-dieharder.o dieharder-dieharder_exit.o dieharder-help.o dieharder-list_rngs.o dieharder-list_tests.o dieharder-output.o dieharder-output_rnds.o dieharder-parsecl.o dieharder-rdieharder.o dieharder-run_all_tests.o dieharder-run_test.o dieharder-set_globals.o dieharder-testbits.o dieharder-time_rng.o dieharder-user_template.o  -L/opt/local/lib ../libdieharder/.libs/libdieharder.a -lm -lgsl -lgslcblas
Undefined symbols for architecture arm64:
  "_insert", referenced from:
      _dab_filltree in libdieharder.a(libdieharder_la-dab_filltree.o)
      _main_filltree in libdieharder.a(libdieharder_la-dab_filltree.o)
  "_insertBit", referenced from:
      _dab_filltree2 in libdieharder.a(libdieharder_la-dab_filltree2.o)
ld: symbol(s) not found for architecture arm64
clang: error: linker command failed with exit code 1 (use -v to see invocation)
...

Я получил этот сбой с установленным MacPorts gsl и выполнив следующее:

$ mkdir dieharder; cd dieharder
$ wget --no-check-certificate https://webhome.phy.duke.edu/~rgb/General/dieharder/dieharder-3.31.1.tgz
$ tar xf dieharder-3.31.1.tgz
$ cd dieharder-3.31.1
$ sudo port install gsl
$ ./configure LDFLAGS=-L/opt/local/lib CPPFLAGS=-I/opt/local/include CFLAGS=-I/opt/local/include --disable-shared
...
$ make
...

Я воспроизвел ошибку с помощью Homebrew:

$ brew install gsl
$ make distclean
$ ./configure LDFLAGS=-L/opt/homebrew/lib CPPFLAGS=-I/opt/homebrew/include CFLAGS=-I/opt/homebrew/include --disable-shared
...
$ make
...
/bin/sh ../libtool --tag=CC   --mode=link gcc -std=c99 -Wall -pedantic -I/usr/local/include -I/opt/homebrew/include  -L/opt/homebrew/lib -o dieharder dieharder-add_ui_rngs.o dieharder-add_ui_tests.o dieharder-choose_rng.o dieharder-dieharder.o dieharder-dieharder_exit.o dieharder-help.o dieharder-list_rngs.o dieharder-list_tests.o dieharder-output.o dieharder-output_rnds.o dieharder-parsecl.o dieharder-rdieharder.o dieharder-run_all_tests.o dieharder-run_test.o dieharder-set_globals.o dieharder-testbits.o dieharder-time_rng.o dieharder-user_template.o ../libdieharder/libdieharder.la -lgsl -lgslcblas -lm -lgsl -lgslcblas
libtool: link: gcc -std=c99 -Wall -pedantic -I/usr/local/include -I/opt/homebrew/include -o dieharder dieharder-add_ui_rngs.o dieharder-add_ui_tests.o dieharder-choose_rng.o dieharder-dieharder.o dieharder-dieharder_exit.o dieharder-help.o dieharder-list_rngs.o dieharder-list_tests.o dieharder-output.o dieharder-output_rnds.o dieharder-parsecl.o dieharder-rdieharder.o dieharder-run_all_tests.o dieharder-run_test.o dieharder-set_globals.o dieharder-testbits.o dieharder-time_rng.o dieharder-user_template.o  -L/opt/homebrew/lib ../libdieharder/.libs/libdieharder.a -lm -lgsl -lgslcblas
Undefined symbols for architecture arm64:
  "_insert", referenced from:
      _dab_filltree in libdieharder.a(libdieharder_la-dab_filltree.o)
      _main_filltree in libdieharder.a(libdieharder_la-dab_filltree.o)
  "_insertBit", referenced from:
      _dab_filltree2 in libdieharder.a(libdieharder_la-dab_filltree2.o)
ld: symbol(s) not found for architecture arm64
clang: error: linker command failed with exit code 1 (use -v to see invocation)
make[1]: *** [dieharder] Error 1
make: *** [dieharder.time] Error 2

Кто-нибудь знает, что здесь может происходить и как правильно настроить это для завершения компиляции в системах Apple Silicon и для них?

3 метода стилизации элементов HTML
3 метода стилизации элементов HTML
Когда дело доходит до применения какого-либо стиля к нашему HTML, существует три подхода: встроенный, внутренний и внешний. Предпочтительным обычно...
Формы c голосовым вводом в React с помощью Speechly
Формы c голосовым вводом в React с помощью Speechly
Пытались ли вы когда-нибудь заполнить веб-форму в области электронной коммерции, которая требует много кликов и выбора? Вас попросят заполнить дату,...
Стилизация и валидация html-формы без использования JavaScript (только HTML/CSS)
Стилизация и валидация html-формы без использования JavaScript (только HTML/CSS)
Будучи разработчиком веб-приложений, легко впасть в заблуждение, считая, что приложение без JavaScript не имеет права на жизнь. Нам становится удобно...
Flatpickr: простой модуль календаря для вашего приложения на React
Flatpickr: простой модуль календаря для вашего приложения на React
Если вы ищете пакет для быстрой интеграции календаря с выбором даты в ваше приложения, то библиотека Flatpickr отлично справится с этой задачей....
В чем разница между Promise и Observable?
В чем разница между Promise и Observable?
Разберитесь в этом вопросе, и вы значительно повысите уровень своей компетенции.
Что такое cURL в PHP? Встроенные функции и пример GET запроса
Что такое cURL в PHP? Встроенные функции и пример GET запроса
Клиент для URL-адресов, cURL, позволяет взаимодействовать с множеством различных серверов по множеству различных протоколов с синтаксисом URL.
0
0
31
1
Перейти к ответу Данный вопрос помечен как решенный

Ответы 1

Ответ принят как подходящий

Оказывается, функции insert не экспортируются в открытый доступ для ARM-компиляции библиотеки:

Undefined symbols for architecture arm64:
  "_insert", referenced from:
      _dab_filltree in libdieharder.a(libdieharder_la-dab_filltree.o)
      _main_filltree in libdieharder.a(libdieharder_la-dab_filltree.o)
  "_insertBit", referenced from:
      _dab_filltree2 in libdieharder.a(libdieharder_la-dab_filltree2.o)

См.: https://github.com/eddelbuettel/dieharder/pull/1/files

После добавления static к этим четырем строкам dieharder компилируется нормально.

Скриншот требуемых изменений: changes

Другие вопросы по теме